{"text_format":"1","workbook":"xlsx","n_sheets":7,"sheets":["Round B1","Round B","build 70B1","Flow charts","build 63","340 table","450 table"],"not_rendered":{"charts":9,"images":4,"macros":1,"external_links":0,"defined_names":0,"comments":6,"pivot_tables":0},"unopened":[],"bounds":{"document_bytes":16777216,"sheet_cells":100000,"rows_first":2000,"rows_last":500,"rows_between":2000,"halvings":0,"cell_chars":16384,"cell_head_chars":4096},"cells_cut":0,"cells_raw":0,"read":"whole","date_system":"1900"}

{"sheet":"Round B1","index":0,"n_rows":148,"n_cols":37,"rows_kept":148,"cut":false,"hidden":false,"merged":[[137,0,142,0],[121,2,121,3],[54,2,55,2],[54,3,55,3],[54,8,55,8],[121,7,121,9],[123,0,128,0],[130,0,135,0],[54,9,55,9],[54,10,55,10],[54,11,55,11],[111,0,119,0],[54,12,55,12],[78,0,88,0],[75,0,75,4],[66,0,66,4],[76,2,76,3],[54,13,55,13],[89,18,89,20],[89,21,89,23],[89,24,89,26],[89,27,89,29],[4,7,4,8],[6,7,6,8],[6,3,6,4],[13,6,14,13],[5,3,5,4],[5,7,5,8],[4,3,4,4],[7,3,7,4],[8,3,8,4],[14,2,14,3],[144,0,147,0],[7,7,7,8],[8,7,8,8],[75,7,76,13],[66,7,67,13],[20,0,27,0],[16,0,18,0],[101,0,109,0],[69,0,72,0],[38,0,45,0],[47,0,53,0],[56,0,63,0],[91,0,99,0],[29,0,36,0],[67,2,67,3],[54,4,55,4]]}
[null,null,"Legend"]
[null,null,"Published Flow Equation Parameters"]
[null,null,"For sample flow calculations: enter pressure data "]
[null,null,"identifies the same Range but depending on PrA sign (or if 'set to 0 Pa' is implemented), different flow equation parameters are used"]
[null,null,"\"Round\"","Date released",null,null,null,"Version released"]
[null,null,1,"2025-06-17",null,null,null,"1.1.5 12A-3D"]
[null,null,"B1","2015-12-01",null,null,null,"2.4.71B1"]
[null,null,"B","2015-06-23",null,null,null,"2.3.62"]
[null,null,"A","2014-11-09",null,null,null,"2.2.49"]
[]
[null,null,"Hide detailed specs:",null,"Yes"]
[null,null,"Metric Units:",null,"m3/h"]
[]
[null,null,null,null,null,null,"Flow = (P-|PrA|*K1)N*(K+P*K3)                \n                                                                                                                                                                                                                                                                                                                                                                                                                                                                                                                                                              Since K1 and K3 are 0 for 300 & 340 & 350 & 450 systems, this equation can be simplified to:  Flow = PN*K , i.e. no backpressure compensation because PrA becomes irrelevant\n\nCondition that must be true, or else “- -“ is displayed for flow result:  \n                                                                                                                                                                                                                                         PrB>=MF, PrB>=|PrA|*K2, PrB>0     "]
[null,null,"Enter Pressures appearing on gauge",null,"Fan Pressure used in flow equation",null,null,null,null,null,null,null,null,null,"min Fan Pressure, Pa",null,null,null,"max Fan Pressure, Pa",null,"min Flow, CFM",null,null,"max Flow, CFM",null,null,"Master plug S/N"]
{"$rows_left_out":134}
{"sheet":"Round B","index":1,"n_rows":111,"n_cols":26,"rows_kept":111,"cut":false,"hidden":true,"merged":[[67,6,68,13],[68,2,68,3],[0,0,1,1],[7,2,7,3],[7,6,7,12],[8,13,9,18],[9,0,11,0],[13,0,20,0],[22,0,30,0],[32,0,41,0],[43,0,52,0],[54,0,64,0],[102,0,110,0],[70,0,73,0],[76,6,77,13],[77,2,77,3],[79,0,89,0],[92,0,100,0]]}
["Published Flow Equation Parameters:",null,"\"Round B\" released: 2015-06-23, DM32 v2.3.62"]
[null,null,"\"Round A\" released: 2014"]
[]
[null,null,"For sample flow calculations: enter pressure data into Columns C & D"]
[null,null,"identifies the same Range but depending on PrA sign (or if 'set to 0 Pa' is implemented), different flow equation parameters are used"]
[]
[]
[null,null,"Enter Pressures appearing on gauge",null,"Fan Pressure used in flow equations",null,"                                                                                                                                                                                                                                                                                                                                                                                                                                                                                                                                                                                                                                                                                                                                                                                                                                                         Condition that must be true, or else “---“ is displayed for flow result:  \n                                                                                                                                                                                                                                                 PrB>=MF, PrB>=|PrA|*K2                                                                                                                               "]
["Device","Range","PrA,           Pa","PrB,          Pa ","P,                  Pa","CFM calculation","CFM displayed on DM32","N","K","K1","K2","K3","MF","Flow = (P-|PrA|)*K1)N*(K+P*K3)                \n                                                                                                                                                                                                                                                                                                                                                                                                                                                                                                                                                              Since K1 and K3 are 0 for 300 & 340 & 350 & 450 systems,                         this equation can be simplified to:  Flow = PN*K , i.e. no backpressure compensation because PrA becomes irrelevant"]
[240,"Open",25,300,{"$f":"IF(OR(C10=\"\",D10=\"\", D10<0),\"---\",        IF(AND(D10>=M10,D10>=ABS(C10)*K10),D10,\"---\"))","v":300},{"$f":"IF(OR(#REF!=\"\", E10=\"\"),\"\",(E10-#REF!*J10)^H10*(I10+E10*L10))","v":{"$error":"#REF!"}},{"$f":"IF(E10=\"---\",\"---\", (E10-ABS(C10)*J10)^H10*(I10+E10*L10))","v":569.21908216841939},0.51149999999999995,30.7774,0,0.2,0,10]
[null,"Mid",25,300,{"$f":"IF(OR(C11=\"\",D11=\"\", D11<0),\"---\",        IF(AND(D11>=M11,D11>=ABS(C11)*K11),D11,\"---\"))","v":300},{"$f":"IF(OR(#REF!=\"\", E11=\"\"),\"\",(E11-#REF!*J11)^H11*(I11+E11*L11))","v":{"$error":"#REF!"}},{"$f":"IF(E11=\"---\",\"---\", (E11-ABS(C11)*J11)^H11*(I11+E11*L11))","v":129.80354050125624},0.54149999999999998,5.9146000000000001,0,0.5,0,25]
[null,"Low",25,300,{"$f":"IF(OR(C12=\"\",D12=\"\", D12<0),\"---\",        IF(AND(D12>=M12,D12>=ABS(C12)*K12),D12,\"---\"))","v":300},{"$f":"IF(OR(#REF!=\"\", E12=\"\"),\"\",(E12-#REF!*J12)^H12*(I12+E12*L12))","v":{"$error":"#REF!"}},{"$f":"IF(E12=\"---\",\"---\", (E12-ABS(C12)*J12)^H12*(I12+E12*L12))","v":31.151266734090079},0.61250000000000004,1.0056,-2.4E-2,0.5,-2.0000000000000001E-4,25]
[]
[300,"Open",25,9,{"$f":"IF(OR(C14=\"\",D14=\"\", D14<0),\"---\",        IF(AND(D14>=M14,D14>=ABS(C14)*K14),D14,\"---\"))","v":"---"},{"$f":"IF(OR(#REF!=\"\", E14=\"\"),\"\",(E14-#REF!*J14)^H14*(I14+E14*L14))","v":{"$error":"#REF!"}},{"$f":"IF(E14=\"---\",\"---\", (E14-ABS(C14)*J14)^H14*(I14+E14*L14))","v":"---"},0.501,28.91,0,0.4,0,20,"PrB cannot be less than MF and PrA*K2, or \"---\" is displayed"]
[null,102,25,100,{"$f":"IF(OR(C15=\"\",D15=\"\", D15<0),\"---\",        IF(AND(D15>=M15,D15>=ABS(C15)*K15),D15,\"---\"))","v":100},{"$f":"IF(OR(#REF!=\"\", E15=\"\"),\"\",(E15-#REF!*J15)^H15*(I15+E15*L15))","v":{"$error":"#REF!"}},{"$f":"IF(E15=\"---\",\"---\", (E15-ABS(C15)*J15)^H15*(I15+E15*L15))","v":161.95105358267432},0.59,10.7,0,0.4,0,100]
{"$rows_left_out":97}
{"sheet":"build 70B1","index":2,"n_rows":117,"n_cols":36,"rows_kept":117,"cut":false,"hidden":true,"merged":[[108,0,116,0],[85,0,95,0],[96,19,96,21],[96,22,96,24],[96,25,96,27],[96,28,96,30],[98,0,106,0],[74,23,74,24],[74,25,74,26],[76,0,79,0],[82,6,83,14],[83,2,83,3],[83,15,83,17],[83,18,83,20],[83,21,83,23],[83,24,83,26],[74,21,74,22],[49,0,58,0],[60,0,70,0],[73,6,74,14],[74,2,74,3],[74,19,74,20],[13,21,13,23],[13,24,13,26],[15,0,17,0],[19,0,26,0],[28,0,36,0],[13,15,13,17],[13,18,13,20],[38,0,47,0],[3,3,3,4],[3,6,3,9],[12,6,13,14],[13,2,13,3],[2,3,2,4],[2,6,2,9],[0,0,1,1],[0,3,0,4],[0,6,0,9],[1,3,1,4],[1,6,1,9]]}
["Published Flow Equation Parameters:",null,"\"Round\"","Date released",null,null,"Version released"]
[null,null,"B1","2015-11-??",null,null,"2.4.??B1",null,null,null,"\"Round B1\" changes, from Round B, are highlighted in yellow"]
[null,null,"B","2015-06-23",null,null,"2.3.62"]
[null,null,"A","2014"]
[]
[null,null,"Hide detailed specs:",null,"Yes"]
[]
[]
[]
[null,null,"For sample flow calculations: enter pressure data into Columns C & D"]
[null,null,"identifies the same Range but depending on PrA sign (or if 'set to 0 Pa' is implemented), different flow equation parameters are used"]
[]
[null,null,null,null,null,null,"Flow = (P-|PrA|)*K1)N*(K+P*K3)                \n                                                                                                                                                                                                                                                                                                                                                                                                                                                                                                                                                              Since K1 and K3 are 0 for 300 & 340 & 350 & 450 systems, this equation can be simplified to:  Flow = PN*K , i.e. no backpressure compensation because PrA becomes irrelevant\n\nCondition that must be true, or else “---“ is displayed for flow result:  \n                                                                                                                                                                                                                                         PrB>=MF, PrB>=|PrA|*K2, PrB>0     "]
[null,null,"Enter Pressures appearing on gauge",null,"Fan Pressure used in flow equations",null,null,null,null,null,null,null,null,null,null,"min Fan Pressure, Pa",null,null,"max Fan Pressure, Pa",null,null,"min Flow, CFM",null,null,"max Flow, CFM",null,null,"Master plug S/N"]
["Device","Range","PrA,           Pa","PrB,          Pa ","P,                  Pa","CFM calculation","CFM displayed on DM32","build 68 reading","Error","N","K","K1","K2","K3","MF",0,25,50,0,50,"25 Pa on 10\" flex",0,25,250,0,50,"25 Pa on 10\" flex"]
{"$rows_left_out":103}
{"sheet":"Flow charts","index":3,"n_rows":302,"n_cols":2,"rows_kept":302,"cut":false,"hidden":false,"merged":[]}
[null,"Legend"]
[null,"Standard Ranges - included with every system with no extra cost"]
[null,"Optional Ranges - ISO 17025 calibration recommended"]
[null,"Not recommended but available if custom sealing performed - ISO 17025 calibration mandatory"]
[300]
[]
[50]
[]
[]
[]
[]
[]
[]
[]
[]
{"$rows_left_out":288}
{"sheet":"build 63","index":4,"n_rows":100,"n_cols":20,"rows_kept":100,"cut":false,"hidden":true,"merged":[[52,2,52,3],[52,6,52,14],[54,0,61,0],[63,0,80,0],[82,0,99,0],[39,0,48,0],[7,2,7,3],[8,15,8,25],[9,0,16,0],[18,0,26,0],[28,0,37,0]]}
[null,null,"\"Round B\" released: 2015-06-23, DM32 v2.3.62"]
[null,null,"\"Round A\" released: 2014"]
[]
[null,null,"For sample flow calculations: enter pressure data into Columns C & D"]
[null,null,"identifies the same Range but depending on PrA sign (or if 'set to 0 Pa' is implemented), different flow coeffcients are used"]
[null,null,"Changed 2015-07-02"]
[]
[null,null,"Enter Pressures appearing on gauge",null,"Fan Pressure used in flow equations",null,"P conditions: PrB>=MF, PrB>=|PrA|*K2"]
["Device","Range","PrA,           Pa","PrB,          Pa ","P,                  Pa","CFM calculation","CFM displayed on DM32","build 63 reading","Error","N","K","K1","K2","K3","MF","Flow = (P-|PrA|)*K1)N*(K+P*K3)                                                                                                                                        Since K1 and K3 are 0 for 300 & 340 & 350 & 450 systems, this equation can be simplified to:  Flow = PN*K"]
[300,"Open",50.5,214.5,{"$f":"IF(OR(C10=\"\",D10=\"\", D10<0),\"---\",        IF(AND(D10>=O10,D10>=ABS(C10)*M10),D10,\"---\"))","v":214.5},{"$f":"IF(OR(#REF!=\"\", E10=\"\"),\"\",(E10-#REF!*L10)^J10*(K10+E10*N10))","v":{"$error":"#REF!"}},{"$f":"IF(E10=\"---\",\"---\", (E10-ABS(C10)*L10)^J10*(K10+E10*N10))","v":479.46508947976116},425.5,{"$f":"(H10-G10)/H10","v":-0.12682747233786407},{"$f":"'Round B1'!I17","v":0.51149999999999995},{"$f":"'Round B1'!J17","v":30.7774},{"$f":"'Round B1'!K17","v":0},{"$f":"'Round B1'!L17","v":0.2},{"$f":"'Round B1'!M17","v":0},{"$f":"'Round B1'!N17","v":10},"PrB cannot be less than MF and PrA*K2, or \"---\" is displayed"]
[null,102,50.5,214.5,214.5,{"$f":"IF(OR(#REF!=\"\", E11=\"\"),\"\",(E11-#REF!*L11)^J11*(K11+E11*N11))","v":{"$error":"#REF!"}},259.42407211113471,253.9,-2.175688109938834E-2,{"$f":"'Round B1'!I22","v":0.56499999999999995},{"$f":"'Round B1'!J22","v":12.49550606158},{"$f":"'Round B1'!K22","v":0},{"$f":"'Round B1'!L22","v":0.4},{"$f":"'Round B1'!M22","v":0},{"$f":"'Round B1'!N22","v":100}]
[null,74,50.5,214.5,214.5,{"$f":"IF(OR(#REF!=\"\", E12=\"\"),\"\",(E12-#REF!*L12)^J12*(K12+E12*N12))","v":{"$error":"#REF!"}},105.03923514850842,106.1,9.9977837086858579E-3,{"$f":"'Round B1'!I23","v":0.501},{"$f":"'Round B1'!J23","v":7.1335625749575859},{"$f":"'Round B1'!K23","v":0},{"$f":"'Round B1'!L23","v":0.25},{"$f":"'Round B1'!M23","v":0},{"$f":"'Round B1'!N23","v":25},"PrB cannot be negative, so \"---\" is displayed"]
[null,47,50.5,214.5,214.5,{"$f":"IF(OR(#REF!=\"\", E13=\"\"),\"\",(E13-#REF!*L13)^J13*(K13+E13*N13))","v":{"$error":"#REF!"}},45.550957182369693,47.44,3.9819620944989559E-2,{"$f":"'Round B1'!I24","v":0.497},{"$f":"'Round B1'!J24","v":3.1606626260331878},{"$f":"'Round B1'!K24","v":0},{"$f":"'Round B1'!L24","v":0.1},{"$f":"'Round B1'!M24","v":0},{"$f":"'Round B1'!N24","v":30}]
[null,29,50.5,214.5,214.5,{"$f":"IF(OR(#REF!=\"\", E14=\"\"),\"\",(E14-#REF!*L14)^J14*(K14+E14*N14))","v":{"$error":"#REF!"}},17.005566172947859,17.61,3.432332919092225E-2,{"$f":"'Round B1'!I25","v":0.50700000000000001},{"$f":"'Round B1'!J25","v":1.1182977634009417},{"$f":"'Round B1'!K25","v":0},{"$f":"'Round B1'!L25","v":0.2},{"$f":"'Round B1'!M25","v":0},{"$f":"'Round B1'!N25","v":30}]
[null,18,50.5,214.5,214.5,{"$f":"IF(OR(#REF!=\"\", E15=\"\"),\"\",(E15-#REF!*L15)^J15*(K15+E15*N15))","v":{"$error":"#REF!"}},6.8252830094907049,6.6539999999999999,-2.5741360007620222E-2,{"$f":"'Round B1'!I26","v":0.51900000000000002},{"$f":"'Round B1'!J26","v":0.42083310570088067},{"$f":"'Round B1'!K26","v":0},{"$f":"'Round B1'!L26","v":0.25},{"$f":"'Round B1'!M26","v":0},{"$f":"'Round B1'!N26","v":30}]
{"$rows_left_out":86}
{"sheet":"340 table","index":5,"n_rows":163,"n_cols":14,"rows_kept":163,"cut":false,"hidden":true,"merged":[[1,2,1,3],[2,13,2,23],[3,0,11,0]]}
[]
[null,null,"Enter Pressures appearing on gauge",null,"Fan Pressure used in flow equations",null,"P conditions: PrB>=MF, PrB>=|PrA|*K2"]
["Device","Range","PrA,           Pa","PrB,          Pa ","P,                  Pa","CFM calculation","CFM displayed on DM32","N","K","K1","K2","K3","MF","Flow = (P-|PrA|)*K1)N*(K+P*K3)                                                                                                                                        Since K1 and K3 are 0 for 300 & 340 & 350 & 450 systems, this equation can be simplified to:  Flow = PN*K"]
[340,"Open",25,300,{"$f":"IF(OR(C4=\"\",D4=\"\", D4<0),\"---\",        IF(AND(C4>0, D4>=M4,D4>=ABS(C4)*K4),D4,\"---\"))","v":300},{"$f":"IF(OR(#REF!=\"\", E4=\"\"),\"\",(E4-#REF!*J4)^H4*(I4+E4*L4))","v":{"$error":"#REF!"}},{"$f":"IF(E4=\"---\",\"---\", (E4-ABS(C4)*J4)^H4*(I4+E4*L4))","v":503.60013781560741},0.501,28.91,0,0.4,0,20,"use when PrA is positive or when \"Set Pressure\" value of \"0\" Pa is entered"]
[null,"Open",-25,300,{"$f":"IF(OR(C5=\"\",D5=\"\", D5<0),\"---\",        IF(AND(C5<0, D5>=M5,D5>=ABS(C5)*K5),D5,\"---\"))","v":300},{"$f":"IF(OR(#REF!=\"\", E5=\"\"),\"\",(E5-#REF!*J5)^H5*(I5+E5*L5))","v":{"$error":"#REF!"}},518.70814195007563,0.501,29.7773,0,0.4,0,20,"use when PrA is negative"]
[null,102,25,300,{"$f":"IF(OR(C6=\"\",D6=\"\", D6<0),\"---\",        IF(AND(D6>=M6,D6>=ABS(C6)*K6),D6,\"---\"))","v":300},{"$f":"IF(OR(#REF!=\"\", E6=\"\"),\"\",(E6-#REF!*J6)^H6*(I6+E6*L6))","v":{"$error":"#REF!"}},309.66014867595442,0.59,10.7,0,0.4,0,100]
[null,74,25,300,300,{"$f":"IF(OR(#REF!=\"\", E7=\"\"),\"\",(E7-#REF!*J7)^H7*(I7+E7*L7))","v":{"$error":"#REF!"}},125.76982512573395,0.50449999999999995,7.0773192087114243,0,0.25,0,15]
[null,47,25,15,15,{"$f":"IF(OR(#REF!=\"\", E8=\"\"),\"\",(E8-#REF!*J8)^H8*(I8+E8*L8))","v":{"$error":"#REF!"}},12.552090929597904,0.5,3.2409359420275905,0,0.1,0,10]
[null,29,25,25,25,{"$f":"IF(OR(#REF!=\"\", E9=\"\"),\"\",(E9-#REF!*J9)^H9*(I9+E9*L9))","v":{"$error":"#REF!"}},5.9896857939955401,0.502,1.1902499077349771,0,0.2,0,20]
[null,18,25,35,35,{"$f":"IF(OR(#REF!=\"\", E10=\"\"),\"\",(E10-#REF!*J10)^H10*(I10+E10*L10))","v":{"$error":"#REF!"}},2.6940531170632043,0.499,0.45700000000000002,0,0.25,0,25]
[null,11,25,300,300,{"$f":"IF(OR(#REF!=\"\", E11=\"\"),\"\",(E11-#REF!*J11)^H11*(I11+E11*L11))","v":{"$error":"#REF!"}},3.2142639484993598,0.48,0.20799999999999999,0,0.25,0,25]
[null,7,25,250,250,{"$f":"IF(OR(#REF!=\"\", E12=\"\"),\"\",(E12-#REF!*J12)^H12*(I12+E12*L12))","v":{"$error":"#REF!"}},1.1352576800004481,0.5,7.1800000000000003E-2,0,0.11,0,25]
[]
[]
[null,null,"Flow in CFM, induced pressure of:",null,null,null,25]
{"$rows_left_out":149}
{"sheet":"450 table","index":6,"n_rows":209,"n_cols":15,"rows_kept":209,"cut":false,"hidden":true,"merged":[[1,2,1,3],[2,13,2,23],[3,0,12,0]]}
[]
[null,null,"Enter Pressures appearing on gauge",null,"Fan Pressure used in flow equations",null,"P conditions: PrB>=MF, PrB>=|PrA|*K2"]
["Device","Range","PrA,           Pa","PrB,          Pa ","P,                  Pa","CFM calculation","CFM displayed on DM32","N","K","K1","K2","K3","MF","Flow = (P-|PrA|)*K1)N*(K+P*K3)                                                                                                                                        Since K1 and K3 are 0 for 300 & 340 & 350 & 450 systems, this equation can be simplified to:  Flow = PN*K"]
[450,{"$f":"'Round B1'!B48","v":74},25,300,{"$f":"IF(OR(C4=\"\",D4=\"\", D4<0),\"---\",        IF(AND(C4>0, D4>=M4,D4>=ABS(C4)*K4),D4,\"---\"))","v":300},{"$f":"IF(OR(#REF!=\"\", E4=\"\"),\"\",(E4-#REF!*J4)^H4*(I4+E4*L4))","v":{"$error":"#REF!"}},{"$f":"IF(E4=\"---\",\"---\", (E4-ABS(C4)*J4)^H4*(I4+E4*L4))","v":125.43833439760898},{"$f":"'Round B1'!I48","v":0.504},{"$f":"'Round B1'!J48","v":7.0788248423279603},{"$f":"'Round B1'!K48","v":0},{"$f":"'Round B1'!L48","v":0.15},{"$f":"'Round B1'!M48","v":0},{"$f":"'Round B1'!N48","v":250},"use when PrA is positive or when \"Set Pressure\" value of \"0\" Pa is entered"]
[null,{"$f":"'Round B1'!#REF!","v":{"$error":"#REF!"}},-25,300,{"$f":"IF(OR(C5=\"\",D5=\"\", D5<0),\"---\",        IF(AND(C5<0, D5>=M5,D5>=ABS(C5)*K5),D5,\"---\"))","v":{"$error":"#REF!"}},{"$f":"IF(OR(#REF!=\"\", E5=\"\"),\"\",(E5-#REF!*J5)^H5*(I5+E5*L5))","v":{"$error":"#REF!"}},{"$f":"IF(E5=\"---\",\"---\", (E5-ABS(C5)*J5)^H5*(I5+E5*L5))","v":{"$error":"#REF!"}},{"$f":"'Round B1'!#REF!","v":{"$error":"#REF!"}},{"$f":"'Round B1'!#REF!","v":{"$error":"#REF!"}},{"$f":"'Round B1'!#REF!","v":{"$error":"#REF!"}},{"$f":"'Round B1'!#REF!","v":{"$error":"#REF!"}},{"$f":"'Round B1'!#REF!","v":{"$error":"#REF!"}},{"$f":"'Round B1'!#REF!","v":{"$error":"#REF!"}},"use when PrA is negative"]
[null,{"$f":"'Round B1'!B49","v":47},25,300,{"$f":"IF(OR(C6=\"\",D6=\"\", D6<0),\"---\",        IF(AND(D6>=M6,D6>=ABS(C6)*K6),D6,\"---\"))","v":300},{"$f":"IF(OR(#REF!=\"\", E6=\"\"),\"\",(E6-#REF!*J6)^H6*(I6+E6*L6))","v":{"$error":"#REF!"}},52.964185114570739,{"$f":"'Round B1'!I49","v":0.4975},{"$f":"'Round B1'!J49","v":3.1018048490120855},{"$f":"'Round B1'!K49","v":0},{"$f":"'Round B1'!L49","v":0.12},{"$f":"'Round B1'!M49","v":0},{"$f":"'Round B1'!N49","v":250}]
[null,{"$f":"'Round B1'!B50","v":29},25,300,300,{"$f":"IF(OR(#REF!=\"\", E7=\"\"),\"\",(E7-#REF!*J7)^H7*(I7+E7*L7))","v":{"$error":"#REF!"}},19.065950468408541,{"$f":"'Round B1'!I50","v":0.49},{"$f":"'Round B1'!J50","v":1.1653839850178234},{"$f":"'Round B1'!K50","v":0},{"$f":"'Round B1'!L50","v":0.15},{"$f":"'Round B1'!M50","v":0},{"$f":"'Round B1'!N50","v":250}]
[null,{"$f":"'Round B1'!B51","v":18},25,15,"---",{"$f":"IF(OR(#REF!=\"\", E8=\"\"),\"\",(E8-#REF!*J8)^H8*(I8+E8*L8))","v":{"$error":"#REF!"}},"---",{"$f":"'Round B1'!I51","v":0.5},{"$f":"'Round B1'!J51","v":0.42377599455193576},{"$f":"'Round B1'!K51","v":0},{"$f":"'Round B1'!L51","v":0.15},{"$f":"'Round B1'!M51","v":0},{"$f":"'Round B1'!N51","v":250}]
[null,{"$f":"'Round B1'!B52","v":11},25,25,"---",{"$f":"IF(OR(#REF!=\"\", E9=\"\"),\"\",(E9-#REF!*J9)^H9*(I9+E9*L9))","v":{"$error":"#REF!"}},"---",{"$f":"'Round B1'!I52","v":0.5},{"$f":"'Round B1'!J52","v":0.17539617552288453},{"$f":"'Round B1'!K52","v":0},{"$f":"'Round B1'!L52","v":0.14000000000000001},{"$f":"'Round B1'!M52","v":0},{"$f":"'Round B1'!N52","v":250}]
[null,{"$f":"'Round B1'!B53","v":7},25,35,"---",{"$f":"IF(OR(#REF!=\"\", E10=\"\"),\"\",(E10-#REF!*J10)^H10*(I10+E10*L10))","v":{"$error":"#REF!"}},"---",{"$f":"'Round B1'!I53","v":0.5},{"$f":"'Round B1'!J53","v":6.1800665872157302E-2},{"$f":"'Round B1'!K53","v":0},{"$f":"'Round B1'!L53","v":0.08},{"$f":"'Round B1'!M53","v":0},{"$f":"'Round B1'!N53","v":250}]
[null,{"$f":"'Round B1'!B54","v":3},25,300,300,{"$f":"IF(OR(#REF!=\"\", E11=\"\"),\"\",(E11-#REF!*J11)^H11*(I11+E11*L11))","v":{"$error":"#REF!"}},0.27447770115593517,{"$f":"'Round B1'!I54","v":0.51300000000000001},{"$f":"'Round B1'!J54","v":1.4714444255275549E-2},{"$f":"'Round B1'!K54","v":0},{"$f":"'Round B1'!L54","v":0.1},{"$f":"'Round B1'!M54","v":0},{"$f":"'Round B1'!N54","v":250}]
[null,{"$f":"'Round B1'!#REF!","v":{"$error":"#REF!"}},25,250,{"$error":"#REF!"},{"$f":"IF(OR(#REF!=\"\", E12=\"\"),\"\",(E12-#REF!*J12)^H12*(I12+E12*L12))","v":{"$error":"#REF!"}},{"$error":"#REF!"},{"$f":"'Round B1'!#REF!","v":{"$error":"#REF!"}},{"$f":"'Round B1'!#REF!","v":{"$error":"#REF!"}},{"$f":"'Round B1'!#REF!","v":{"$error":"#REF!"}},{"$f":"'Round B1'!#REF!","v":{"$error":"#REF!"}},{"$f":"'Round B1'!#REF!","v":{"$error":"#REF!"}},{"$f":"'Round B1'!#REF!","v":{"$error":"#REF!"}}]
[null,{"$f":"'Round B1'!#REF!","v":{"$error":"#REF!"}},null,null,null,null,null,{"$f":"'Round B1'!#REF!","v":{"$error":"#REF!"}},{"$f":"'Round B1'!#REF!","v":{"$error":"#REF!"}},{"$f":"'Round B1'!#REF!","v":{"$error":"#REF!"}},{"$f":"'Round B1'!#REF!","v":{"$error":"#REF!"}},{"$f":"'Round B1'!#REF!","v":{"$error":"#REF!"}},{"$f":"'Round B1'!#REF!","v":{"$error":"#REF!"}}]
[]
[null,null,"Flow in CFM, induced pressure of:",null,null,null,250]
{"$rows_left_out":194}